Target
Muscarinic acetylcholine receptor M3
Ligand
BDBM50296331
Substrate
Meas. Tech.
[3H]-NMS Binding Assay
Temperature
298.15±n/a K
IC50
4.40±n/a nM
Comments
extracted
Citation
 Fernandez Forner, MDPrat Quinones, MBuil Albero, MA Quinuclidine derivatives and medicinal compositions containing the same US Patent  US9687478 Publication Date 6/27/2017 
Target
Name:
Muscarinic acetylcholine receptor M3
Synonyms:
ACM3_HUMAN Cholinergic, muscarinic M3 Muscarinic receptor M3 | RecName: Full=Muscarinic acetylcholine receptor M3
Type:
Enzyme
Mol. Mass.:
66151.03
Organism:
Homo sapiens (Human)
Description:
P20309
Residue:
590
  
Inhibitor
Name:
BDBM50296331
Synonyms:
(3R)-3-{[Hydroxy(di-2-thienyl)acetyl]oxy}-1-(3-phenoxypropyl)-1-azoniabicyclo[2.2.2]octane bromide Aclidinium Tudorza Pressair US9687478, 44
Type:
Small organic molecule
Emp. Form.:
C26H30NO4S2
Mol. Mass.:
484.65
SMILES:
OC(C(=O)O[C@H]1C[N+]2(CCCOc3ccccc3)CCC1CC2)(c1cccs1)c1cccs1
: