Target
Fibroblast growth factor receptor 1
Ligand
BDBM6572
Substrate
Poly(E:Y)
Meas. Tech.
Kinase Assay
pH
7.4±n/a
Temperature
298.15±n/a K
IC50
934±n/a nM
Citation
 Kraker, AJHartl, BGAmar, AMBarvian, MRShowalter, HDMoore, CW Biochemical and cellular effects of c-Src kinase-selective pyrido[2,3-d]pyrimidine tyrosine kinase inhibitors. Biochem Pharmacol 60:885-98 (2000)  
Target
Name:
Fibroblast growth factor receptor 1
Synonyms:
BFGFR Basic fibroblast growth factor receptor 1 (FGFR1) CEK FGFR-1 FGFR-1, (FL) FGFR1_HUMAN FLT2 Fibroblast growth factor receptor 1 (FGFR-1) Fms-like tyrosine kinase 2 N-sam bFGF-R | c-fgr
Type:
Receptor
Mol. Mass.:
91861.70
Organism:
Homo sapiens (Human)
Description:
P11362
Residue:
822
  
Inhibitor
Name:
BDBM6572
Synonyms:
6-(2,6-dichlorophenyl)-2-[(4-fluoro-3-methylphenyl)amino]-8-methyl-7H,8H-pyrido[2,3-d]pyrimidin-7-one PD-180970 | PD180970
Type:
Small organic molecule
Emp. Form.:
C21H15Cl2FN4O
Mol. Mass.:
429.274
SMILES:
Cc1cc(Nc2ncc3cc(-c4c(Cl)cccc4Cl)c(=O)n(C)c3n2)ccc1F
:
Substrate
Name:
Poly(E:Y)
Synonyms:
Type:
Random polymer
Mol. Mass.:
358.43
Organism:
Description:
Random copolymer of glutamic acid and tyrosine (4:1).
Residue:
3
NA