Target
Pancreatic triacylglycerol lipase
Ligand
BDBM246493
Substrate
BDBM246504
Meas. Tech.
In Vitro Pancreatic Lipase Assay
pH
7.4±0
Temperature
310.15±0 K
Ki
2.67e+3± 3.0e+2 nM
IC50
1.272e+4± 1.41e+3 nM
Citation
 Yang, MHChin, YWYoon, KDKim, J Phenolic compounds with pancreatic lipase inhibitory activity from Korean yam (Dioscorea opposita). J Enzyme Inhib Med Chem 29:1-6 (2014)  
Target
Name:
Pancreatic triacylglycerol lipase
Synonyms:
LIPP_PIG PNLIP Pancreatic lipase | Pancreatic triacylglycerol lipase
Type:
Enzyme
Mol. Mass.:
50080.69
Organism:
Sus scrofa (Pig)
Description:
P00591
Residue:
450
  
Inhibitor
Name:
BDBM246493
Synonyms:
3,5-Dimethoxy-2,7-phenanthrenediol (11)
Type:
Small organic molecule
Emp. Form.:
C16H14O4
Mol. Mass.:
270.28
SMILES:
COc1cc2c(ccc3cc(O)cc(OC)c23)cc1O
:
Substrate
Name:
BDBM246504
Synonyms:
4-Methylumbelliferyl oleate (4-MU oleate)
Type:
Small organic molecule
Emp. Form.:
C28H40O4
Mol. Mass.:
440.6148
SMILES:
CCCCCCCC\C=C/CCCCCCCC(=O)Oc1ccc2c(C)cc(=O)oc2c1
: