Target
Carbonic anhydrase 1
Ligand
BDBM246573
Substrate
Meas. Tech.
Thermal Shift Assay (TSA)
pH
7±n/a
Kd
1.67±n/a nM
Comments
extracted
Citation
 Zubriene, ACapkauskaite, EGylyte, JKi?onaite, MTumkevicius, SMatulis, D Benzenesulfonamides with benzimidazole moieties as inhibitors of carbonic anhydrases I, II, VII, XII and XIII. J Enzyme Inhib Med Chem 29:124-31 (2014)  
Target
Name:
Carbonic anhydrase 1
Synonyms:
CA-I CAB Carbonate dehydratase I Carbonic anhydrase 1 (CA I) Carbonic anhydrase 1 (Recombinant CA I) Carbonic anhydrase B Carbonic anhydrase I (CA I) Carbonic anhydrase I (CAI) Carbonic anhydrase isoenzyme I (hCA I) | hCA
Type:
Enzyme
Mol. Mass.:
28873.37
Organism:
Homo sapiens (Human)
Description:
P00915
Residue:
261
  
Inhibitor
Name:
BDBM246573
Synonyms:
2-Chloro-4-{[2-(methylthio)-1H-benzimidazol-1-yl]acetyl}-benzenesulfonamide (2j)
Type:
Small organic molecule
Emp. Form.:
C16H14ClN3O3S2
Mol. Mass.:
395.884
SMILES:
CSc1nc2ccccc2n1CC(=O)c1ccc(c(Cl)c1)S(N)(=O)=O
: