Target
Isocitrate dehydrogenase [NADP] cytoplasmic
Ligand
BDBM247777
Substrate
Meas. Tech.
Fluorescence Biochemical Assay
pH
7.5±n/a
Temperature
298.15±n/a K
IC50
45.5±n/a nM
Comments
extracted
Citation
 Caferro, TRChen, ZCho, YSCostales, AQLevell, JRLiu, GManning, JRSendzik, MShafer, CShultz, MDSutton, JWang, YZhao, Q 3-pyrimidin-4-yl-oxazolidin-2-ones as inhibitors of mutant IDH US Patent  US9434719 Publication Date 9/6/2016 
Target
Name:
Isocitrate dehydrogenase [NADP] cytoplasmic
Synonyms:
Cytosolic NADP-isocitrate dehydrogenase IDH1 IDP Isocitrate dehydrogenase 1 (IDH1) Oxalosuccinate decarboxylase | PICD
Type:
Protein
Mol. Mass.:
46661.29
Organism:
Homo sapiens (Human)
Description:
O75874
Residue:
414
  
Inhibitor
Name:
BDBM247777
Synonyms:
US10112931, Example 380 US9688672, Example 380
Type:
Small organic molecule
Emp. Form.:
C20H21ClN6O2S
Mol. Mass.:
444.938
SMILES:
C[C@@H](N)[C@H]1COC(=O)N1c1ccnc(N[C@@H](C)c2cnc(s2)-c2ccc(Cl)cc2)n1
: