Target
Voltage-dependent N-type calcium channel subunit alpha-1B
Ligand
BDBM247256
Substrate
Meas. Tech.
Patch Clamp/Inhibition Assay
Ki
200±n/a nM
Citation
 Pevarello, P Fluorinated arylalkylaminocarboxamide derivatives US Patent  US9447029 Publication Date 9/20/2016 
Target
Name:
Voltage-dependent N-type calcium channel subunit alpha-1B
Synonyms:
BIII CAC1B_HUMAN CACNA1B Calcium channel (Type N) Voltage-dependent N-type calcium channel subunit alpha-1B Voltage-gated N-type calcium channel alpha-1B subunit Voltage-gated calcium channel Voltage-gated calcium channel subunit alpha Cav2.2 ((alpha 1B, beta 1b, alpha 2 delta-1) | calcium channel, voltage-dependent, N type, alpha 1B subunit
Type:
Enzyme
Mol. Mass.:
262548.16
Organism:
Homo sapiens (Human)
Description:
Q00975
Residue:
2339
  
Inhibitor
Name:
BDBM247256
Synonyms:
US9447029, 1-15
Type:
Small organic molecule
Emp. Form.:
C18H26F2N2O2
Mol. Mass.:
340.408
SMILES:
CCCCOc1cccc(c1)C(F)(F)CNCC(=O)N1CCCC1
: