Target
Microtubule-associated protein tau
Ligand
BDBM247407
Substrate
Meas. Tech.
Competitive Binding Assay
Temperature
298.15±n/a K
Ki
21.4±n/a nM
Comments
extracted
Citation
 Kudo, YFurumoto, SOkamura, N Tau imaging probe US Patent  US9452985 Publication Date 9/27/2016 
Target
Name:
Microtubule-associated protein tau
Synonyms:
MAPT MTBT1 Neurofibrillary tangle protein Paired helical filament-tau TAU_HUMAN | Tau Protein
Type:
Protein
Mol. Mass.:
78928.63
Organism:
Homo sapiens (Human)
Description:
P10636
Residue:
758
  
Inhibitor
Name:
BDBM247407
Synonyms:
US9452985, THK-5129
Type:
Small organic molecule
Emp. Form.:
C19H20FN3O2
Mol. Mass.:
341.3794
SMILES:
CN(C)c1ccc(cn1)-c1ccc2cc(OCC(O)CF)ccc2n1
: