Target
Transient receptor potential M8 protein
Ligand
BDBM248480
Substrate
Meas. Tech.
Functional Assay
Temperature
310.15±n/a K
IC50
0.8±n/a nM
Comments
extracted
Citation
 Branum, STColburn, RWDax, SLFlores, CMJetter, MCLiu, YLudovici, DMacielag, MJMatthews, JMMcNally, JJAndraka, LMRussell, RKQin, NTeleha, CWells, KMYouells, SCYoungman, MA Sulfonamides as TRPM8 modulators US Patent  US9434711 Publication Date 9/6/2016 
Target
Name:
Transient receptor potential M8 protein
Synonyms:
Cold-menthol receptor (TRPM8) Transient receptor potential M8 protein Transient receptor potential melastatin subfamily, type 8 (TRPM8)
Type:
Enzyme
Mol. Mass.:
127589.43
Organism:
Canis lupus familiaris (Dog)
Description:
Q1A7N1
Residue:
1104
  
Inhibitor
Name:
BDBM248480
Synonyms:
US9434711, 361
Type:
Small organic molecule
Emp. Form.:
C26H21F4NO5S2
Mol. Mass.:
567.572
SMILES:
CC(C)(O)c1c(sc2ccccc12)N(Cc1ccc(F)c(c1)C(F)(F)F)S(=O)(=O)c1ccc(cc1)C(O)=O
: