Target
Serine/threonine-protein kinase pim-2
Ligand
BDBM249034
Substrate
Meas. Tech.
Kinase Binding Assay
pH
7.2±n/a
Temperature
298.15±n/a K
Ki
8.79±n/a nM
Comments
extracted
Citation
 Do, SHu, HKolesnikov, ATsui, VHWang, X 5-azaindazole compounds and methods of use US Patent  US9434725 Publication Date 9/6/2016 
Target
Name:
Serine/threonine-protein kinase pim-2
Synonyms:
PIM2 Pim-2h Serine/threonine-protein kinase PIM | Serine/threonine-protein kinase pim-2 (PIM2)
Type:
Serine/threonine-protein kinase
Mol. Mass.:
34185.93
Organism:
Homo sapiens (Human)
Description:
Q9P1W9
Residue:
311
  
Inhibitor
Name:
BDBM249034
Synonyms:
US9434725, 265
Type:
Small organic molecule
Emp. Form.:
C21H21N7O
Mol. Mass.:
387.4377
SMILES:
Cc1cncc(n1)-c1cc2n(ncc2cn1)-c1cccc(n1)C1CNCCC1O
: