Target
Hexokinase-4
Ligand
BDBM249149
Substrate
Meas. Tech.
Glucokinase-Activating Assay
Temperature
303.15±n/a K
EC50
23.8±n/a nM
Comments
extracted
Citation
 Lin, SZhang, RCampbell, BDewnani, SVXu, JXu, LParmee, ERKats-Kagan, R Glucokinase activator compounds, compositions containing such compounds, and methods of treatment US Patent  US9453038 Publication Date 9/27/2016 
Target
Name:
Hexokinase-4
Synonyms:
GCK Glucokinase (GK) HK IV HXK4_HUMAN Hexokinase-D
Type:
Enzyme
Mol. Mass.:
52175.81
Organism:
Homo sapiens (Human)
Description:
P35557
Residue:
465
  
Inhibitor
Name:
BDBM249149
Synonyms:
US9453038, 27
Type:
Small organic molecule
Emp. Form.:
C26H23N3O4
Mol. Mass.:
441.4785
SMILES:
CN1C(CCC1=O)c1cc2[nH]c(cc2cc1Oc1ccc(CC(O)=O)cc1)-c1ccccn1
: