Target
Cytochrome P450 11B1, mitochondrial
Ligand
BDBM249230
Substrate
Meas. Tech.
G402-Based Assay
EC50
7.5±n/a nM
Citation
 Aebi, JAmrein, KHornsperger, BKuhn, BMaerki, HPMayweg, AVTan, X Dihydroquinoline-2-one derivatives US Patent  US9458135 Publication Date 10/4/2016 
Target
Name:
Cytochrome P450 11B1, mitochondrial
Synonyms:
C11B1_HUMAN CYPXIB1 Cytochrome P450 11B1 Cytochrome P450 11B1, mitochondrial | S11BH
Type:
Enzyme
Mol. Mass.:
57591.44
Organism:
Homo sapiens (Human)
Description:
P15538
Residue:
503
  
Inhibitor
Name:
BDBM249230
Synonyms:
US9458135, 18
Type:
Small organic molecule
Emp. Form.:
C21H18FN3O2
Mol. Mass.:
363.3849
SMILES:
CN1C(=O)CCc2cc(ccc12)-c1cncc(COc2cccc(F)n2)c1
: