Target
Tyrosine-protein kinase BTK
Ligand
BDBM250008
Substrate
Meas. Tech.
Time-Resolved Fluorescence Resonance Energy Transfer Assay
Temperature
298.15±n/a K
IC50
0.23±n/a nM
Comments
extracted
Citation
 Wang, ZGuo, Y Substituted pyrazolo[1,5-a]pyrimidines as bruton's tyrosine kinase modulators US Patent  US9447106 Publication Date 9/20/2016 
Target
Name:
Tyrosine-protein kinase BTK
Synonyms:
AGMX1 Agammaglobulinaemia tyrosine kinase B cell progenitor kinase BPK BTK_HUMAN Tyrosine Kinase BTK Tyrosine-protein kinase BTK (BTK)
Type:
Enzyme
Mol. Mass.:
76289.95
Organism:
Homo sapiens (Human)
Description:
Q06187
Residue:
659
  
Inhibitor
Name:
BDBM250008
Synonyms:
US9447106, 133a (peak 1)
Type:
Small organic molecule
Emp. Form.:
C24H25N5O3
Mol. Mass.:
431.487
SMILES:
COc1cc(ccc1C)-c1nn2[C@H](CCNc2c1C(N)=O)c1ccccc1NC(=O)C=C
: