Target
Tyrosine-protein kinase BTK
Ligand
BDBM250047
Substrate
Meas. Tech.
Time-Resolved Fluorescence Resonance Energy Transfer Assay
Temperature
298.15±n/a K
IC50
0.15±n/a nM
Comments
extracted
Citation
 Wang, ZGuo, Y Substituted pyrazolo[1,5-a]pyrimidines as bruton's tyrosine kinase modulators US Patent  US9447106 Publication Date 9/20/2016 
Target
Name:
Tyrosine-protein kinase BTK
Synonyms:
AGMX1 Agammaglobulinaemia tyrosine kinase B cell progenitor kinase BPK BTK_HUMAN Tyrosine Kinase BTK Tyrosine-protein kinase BTK (BTK)
Type:
Enzyme
Mol. Mass.:
76289.95
Organism:
Homo sapiens (Human)
Description:
Q06187
Residue:
659
  
Inhibitor
Name:
BDBM250047
Synonyms:
US10005782, Compound 169 US9556188, Compound 169
Type:
Small organic molecule
Emp. Form.:
C23H21Cl2N5O3
Mol. Mass.:
486.351
SMILES:
COc1c(Cl)cc(cc1Cl)-c1nn2C(CCNc2c1C(N)=O)c1ccccc1NC(=O)C=C
: