Target
Trace amine-associated receptor 1
Ligand
BDBM250212
Substrate
Meas. Tech.
Radioligand Binding Assay
pH
7.4±n/a
Temperature
310.15±n/a K
Ki
0.3±n/a nM
Comments
extracted
Citation
 Groebke Zbinden, KNorcross, RPflieger, P Substituted benzamides US Patent  US9452980 Publication Date 9/27/2016 
Target
Name:
Trace amine-associated receptor 1
Synonyms:
TAAR1_MOUSE Taar1 Trace amine receptor 1 (TARR1) Trace amine-associated receptor1 | Trar1
Type:
Protein
Mol. Mass.:
37635.41
Organism:
Mus musculus (Mouse)
Description:
Q923Y8
Residue:
332
  
Inhibitor
Name:
BDBM250212
Synonyms:
US10501411, Example 122 US9452980, 122
Type:
Small organic molecule
Emp. Form.:
C20H21F3N2O2
Mol. Mass.:
378.3881
SMILES:
FC(F)(F)c1ccc(CCOC(=O)Nc2ccc(cc2)C2CCNC2)cc1
: