Target
Melanocyte-stimulating hormone receptor
Ligand
BDBM250673
Substrate
Meas. Tech.
cAMP Assay
pH
7.5±n/a
Temperature
310.15±n/a K
EC50
0.002±n/a nM
Comments
extracted
Citation
 Yang, WShi, Y Melanocortin-1 receptor-specific cyclic peptides US Patent  US9447148 Publication Date 9/20/2016 
Target
Name:
Melanocyte-stimulating hormone receptor
Synonyms:
MC1-R MSH-R MSHR_HUMAN Melanocortin receptor (M1 and M4) Melanocortin receptor 1 (MC1-R) | Melanocortin receptor 1 (MC1R)
Type:
Enzyme
Mol. Mass.:
34717.23
Organism:
Homo sapiens (Human)
Description:
Q01726
Residue:
317
  
Inhibitor
Name:
BDBM250673
Synonyms:
US9447148, 9.42 | US9447148, 9.55
Type:
Small organic molecule
Emp. Form.:
C48H70N14O9
Mol. Mass.:
987.1578
SMILES:
CCCC[C@H](NC(C)=O)C(=O)N[C@H]1CCC(=O)NCC[C@H](NC(=O)[C@H](CCCNC(N)=N)NC(=O)[C@@H](Cc2ccccc2)NC(=O)[C@H](CCCN)NC1=O)C(=O)N[C@@H](Cc1c[nH]c2ccccc12)C(N)=O
: