Target
Glycogen synthase kinase-3 beta
Ligand
BDBM251575
Substrate
Meas. Tech.
GSKbeta Assay
pH
7±n/a
Temperature
298.15±n/a K
IC50
0.2±n/a nM
Comments
extracted
Citation
 Visser, MSLuzzio, MJPapillon, J Protein kinase C inhibitors and methods of their use US Patent  US9452998 Publication Date 9/27/2016 
Target
Name:
Glycogen synthase kinase-3 beta
Synonyms:
GSK-3 beta GSK3B Glycogen synthase kinase 3 beta (GSK3B) Glycogen synthase kinase-3 beta (GSK-3B) Glycogen synthase kinase-3 beta (GSK3B) Glycogen synthase kinase-3beta (GSK3B) | Serine/threonine-protein kinase GSK3B
Type:
Enzyme
Mol. Mass.:
46756.38
Organism:
Homo sapiens (Human)
Description:
P49841
Residue:
420
  
Inhibitor
Name:
BDBM251575
Synonyms:
US9452998, Table 4 Compound 5
Type:
Small organic molecule
Emp. Form.:
C22H25N7O2
Mol. Mass.:
419.4796
SMILES:
COc1ccc(cc1)-c1cnc(N)c(n1)C(=O)Nc1cnccc1N1CCC(N)CC1
: