Target
Lysophosphatidic acid receptor 5
Ligand
BDBM251671
Substrate
Meas. Tech.
Receptor Assay
Temperature
310.15±n/a K
IC50
31±n/a nM
Comments
extracted
Citation
 Buffham, WCanning, HDavenport, RFarnaby, WMack, SParmar, AWright, S Compounds US Patent  US9464060 Publication Date 10/11/2016 
Target
Name:
Lysophosphatidic acid receptor 5
Synonyms:
GPR92 LPAR5 Lysophosphatidic acid receptor 5 | Lysophosphatidic acid receptor 5 (LPA5)
Type:
Enzyme
Mol. Mass.:
41372.36
Organism:
Homo sapiens (Human)
Description:
Q9H1C0
Residue:
372
  
Inhibitor
Name:
BDBM251671
Synonyms:
US10100018, Example 7 | US9464060, 7
Type:
Small organic molecule
Emp. Form.:
C27H26FNO5
Mol. Mass.:
463.4974
SMILES:
COC1CC(CN(Cc2ccc(cc2)C(O)=O)C(=O)c2ccc(Oc3ccccc3F)cc2)C1
: