Target
Lysophosphatidic acid receptor 5
Ligand
BDBM251700
Substrate
Meas. Tech.
Receptor Assay
Temperature
310.15±n/a K
IC50
24±n/a nM
Comments
extracted
Citation
 Buffham, WCanning, HDavenport, RFarnaby, WMack, SParmar, AWright, S Compounds US Patent  US9464060 Publication Date 10/11/2016 
Target
Name:
Lysophosphatidic acid receptor 5
Synonyms:
GPR92 LPAR5 Lysophosphatidic acid receptor 5 | Lysophosphatidic acid receptor 5 (LPA5)
Type:
Enzyme
Mol. Mass.:
41372.36
Organism:
Homo sapiens (Human)
Description:
Q9H1C0
Residue:
372
  
Inhibitor
Name:
BDBM251700
Synonyms:
US10100018, Example 36 | US9464060, 36
Type:
Small organic molecule
Emp. Form.:
C29H24ClNO4
Mol. Mass.:
485.958
SMILES:
OC(=O)c1ccc(CN(CCc2ccccc2)C(=O)c2ccc(Oc3ccccc3Cl)cc2)cc1
: