Target
Rho-associated protein kinase 1
Ligand
BDBM251934
Substrate
Meas. Tech.
In Vitro Assay
pH
7.5±n/a
IC50
0.85±n/a nM
Comments
extracted
Citation
 Quan, MLHu, ZWang, CGlunz, PW Phenylpyrazole derivatives as potent ROCK1 and ROCK2 inhibitors US Patent  US9458110 Publication Date 10/4/2016 
Target
Name:
Rho-associated protein kinase 1
Synonyms:
ROCK-I ROCK1_HUMAN Rho-associated protein kinase Rho-associated, coiled-coil-containing protein kinase 1 Rho-kinase (ROCK I) p160 ROCK-1 | p160ROCK
Type:
Serine/threonine-protein kinase
Mol. Mass.:
158156.77
Organism:
Homo sapiens (Human)
Description:
Q13464
Residue:
1354
  
Inhibitor
Name:
BDBM251934
Synonyms:
US9458110, 6
Type:
Small organic molecule
Emp. Form.:
C18H17N3O3
Mol. Mass.:
323.3459
SMILES:
COc1cc(ccc1-c1cn[nH]c1)C(=O)NCc1cccc(O)c1
: