Target
P2X purinoceptor 7
Ligand
BDBM254374
Substrate
Meas. Tech.
Radioligand Binding Assay
Ki
2.3±n/a nM
Citation
 Alcazar Vaca, MJAndres Gil, JIChrovian, CCCoate, HRDe Angelis, MDvorak, CAGelin, CFLetavic, MASavall, BMSoyode-Johnson, AStenne, BMSwanson, DM P2X7 modulators US Patent  US9464084 Publication Date 10/11/2016 
Target
Name:
P2X purinoceptor 7
Synonyms:
ATP receptor P2RX7_HUMAN P2X purinoceptor 7 (P2X7) P2Z receptor | Purinergic receptor
Type:
Protein
Mol. Mass.:
68602.85
Organism:
Homo sapiens (Human)
Description:
Q99572
Residue:
595
  
Inhibitor
Name:
BDBM254374
Synonyms:
US10112937, Example 281 US9464084, 281
Type:
Small organic molecule
Emp. Form.:
C18H15F3N6O
Mol. Mass.:
388.3465
SMILES:
Cc1c(cccc1C(F)(F)F)C(=O)N1CCc2c(C1)nnn2-c1ncccn1
: