Target
Cyclin-dependent kinase 4/G1/S-specific cyclin-D1
Ligand
BDBM6678
Substrate
ING Peptide
Meas. Tech.
CDK Kinase Inhibition Assay
Temperature
298.15±n/a K
IC50
827±n/a nM
Comments
extracted
Citation
 Jaramillo, Cde Diego, JEHamdouchi, CCollins, EKeyser, HSanchez-Martinez, Cdel Prado, MNorman, BBrooks, HBWatkins, SASpencer, CDDempsey, JAAnderson, BDCampbell, RMLeggett, TPatel, BSchultz, RMEspinosa, JVieth, MZhang, FTimm, DE Aminoimidazo[1,2-a]pyridines as a new structural class of cyclin-dependent kinase inhibitors. Part 1: Design, synthesis, and biological evaluation. Bioorg Med Chem Lett 14:6095-9 (2004)  
Target
Name:
Cyclin-dependent kinase 4/G1/S-specific cyclin-D1
Synonyms:
CDK4/CycD CDK4/Cyclin D1 Cyclin-Dependent Kinase 4 (CDK4) Cyclin-dependent kinase 4/G1/S-specific cyclin D1 | Cyclin-dependent kinase 4/cyclin D1
Type:
Protein Complex
Mol. Mass.:
Description:
CDK4/D1 complexes were purified from insect cells co-infected with baculovirus vectors containing each of the components.
Components:
This complex has 2 components.
Component 1
Name:
Cyclin-dependent kinase 4
Synonyms:
CDK4 Cell division protein kinase 4 PSK-J3
Type:
Enzyme Subunit
Mol. Mass.:
33731.96
Organism:
Homo sapiens (Human)
Description:
P11802
Residue:
303
  
Component 2
Name:
G1/S-specific cyclin-D1
Synonyms:
B-cell lymphoma 1 protein BCL-1 oncogene CCND1 PRAD1 | PRAD1 oncogene
Type:
Enzyme Subunit
Mol. Mass.:
33717.70
Organism:
Homo sapiens (Human)
Description:
Residue:
295
  
Inhibitor
Name:
BDBM6678
Synonyms:
3-[(2-chloro-6-fluorophenyl)carbonyl]-6-[(2,6-difluorophenyl)carbonyl]imidazo[1,2-a]pyridin-2-amine | aminoimidazo[1,2-a]pyridine deriv. 15
Type:
Small organic molecule
Emp. Form.:
C21H11ClF3N3O2
Mol. Mass.:
429.779
SMILES:
Nc1nc2ccc(cn2c1C(=O)c1c(F)cccc1Cl)C(=O)c1c(F)cccc1F
:
Substrate
Name:
ING Peptide
Synonyms:
Type:
Peptide
Mol. Mass.:
1341.50
Organism:
Description:
amino acid residues 246-257 from human retinoblastoma 1 protein.
Residue:
12
INGSPRTPRRGQ