Target
Prothrombin
Ligand
BDBM254911
Substrate
BDBM254912
Meas. Tech.
Inhibition Assay
pH
7.4±n/a
Temperature
295.15±n/a K
IC50
0.38±n/a nM
Comments
extracted
Citation
 Allerheiligen, SBuchmüller, AEngel, KGerdes, CGericke, KMGerisch, MHeitmeier, SHillisch, AKinzel, TLienau, PRiedl, BRöhrig, SSchmidt, MVStrassburger, JTersteegen, A Substituted benzoxazoles US Patent  US9493472 Publication Date 11/15/2016 
Target
Name:
Prothrombin
Synonyms:
Activation peptide fragment 1 Coagulation factor II Prothrombin precursor Thrombin heavy chain | Thrombin light chain
Type:
Protein
Mol. Mass.:
70029.57
Organism:
Homo sapiens (Human)
Description:
P00734
Residue:
622
  
Inhibitor
Name:
BDBM254911
Synonyms:
US9493472, 33
Type:
Small organic molecule
Emp. Form.:
C24H24ClFN4O4
Mol. Mass.:
486.923
SMILES:
COc1cc(cc2nc(N[C@H](CF)c3cccc(Cl)c3)oc12)C(=O)N1CC2(CC2)NC(=O)C1C
:
Substrate
Name:
BDBM254912
Synonyms:
US9493472, Boc-Asp(OBzl)-Pro-Arg-AMC
Type:
Small organic molecule
Emp. Form.:
C37H47N7O9
Mol. Mass.:
733.8106
SMILES:
[#6]-c1cc(=O)oc2cc(-[#7]-[#6](=O)-[#6](-[#6]-[#6]-[#6]\[#7]=[#6](\[#7])-[#7])-[#7]-[#6](=O)-[#6]-3-[#6]-[#6]-[#6]-[#7]-3-[#6](=O)-[#6](-[#6]-[#6](=O)-[#8]-[#6]-c3ccccc3)-[#7]-[#6](=O)-[#8]C([#6])([#6])[#6])ccc12
: