Target
Tyrosine-protein kinase JAK3
Ligand
BDBM255020
Substrate
Meas. Tech.
Enzyme Assay
IC50
43±n/a nM
Citation
 Takahashi, KWatanabe, THayashi, KKurihara, KNakamura, TYamamoto, ANishimura, TKamiyama, THidaka, Y Tricyclic pyrrolopyridine compound, and JAK inhibitor US Patent  US9475813 Publication Date 10/25/2016 
Target
Name:
Tyrosine-protein kinase JAK3
Synonyms:
JAK-3 JAK3_HUMAN Janus kinase 3 (JAK3) L-JAK | Leukocyte janus kinase
Type:
Protein
Mol. Mass.:
125111.08
Organism:
Homo sapiens (Human)
Description:
P52333
Residue:
1124
  
Inhibitor
Name:
BDBM255020
Synonyms:
US9475813, 25
Type:
Small organic molecule
Emp. Form.:
C22H28F3N5O
Mol. Mass.:
435.4858
SMILES:
FC(F)(F)CNC[C@H]1CC[C@@H](CC1)N1CN(CC2CC2)C(=O)c2cnc3[nH]ccc3c12
: