Target
Amine oxidase [flavin-containing] B
Ligand
BDBM65037
Substrate
Meas. Tech.
Inhibitory Activity Assay
pH
7.5±n/a
Temperature
298.15±n/a K
IC50
>100000±n/a nM
Comments
extracted
Citation
 Matsumoto, SHattori, YToyofuku, MMorimoto, SDaini, MKojima, TKaku, TIto, M Cyclopropanamine compound and use thereof US Patent  US9487511 Publication Date 11/8/2016 
Target
Name:
Amine oxidase [flavin-containing] B
Synonyms:
AOFB_HUMAN MAOB Monoamine oxidase type B (MAO B) Monoamine oxidase type B (MAOB)
Type:
Protein
Mol. Mass.:
58768.76
Organism:
Homo sapiens (Human)
Description:
P27338
Residue:
520
  
Inhibitor
Name:
BDBM65037
Synonyms:
BDBM65038 | US9487511, 71
Type:
Emp. Form.:
C17H24N2O2S
Mol. Mass.:
320.45
SMILES:
O=C(NC1CCOCC1)c1csc(c1)[C@H]1C[C@H]1NCC1CC1
: