Target
Beta-secretase 1
Ligand
BDBM256786
Substrate
Meas. Tech.
HTRF FRET Assay
pH
5±n/a
Temperature
303.15±n/a K
Ki
1±n/a nM
Comments
extracted
Citation
 Cumming, JNKaelin, Jr., DEScott, JDStamford, AWIserloh, U C6-azaspiro iminothiadiazine dioxides as bace inhibitors, compositions, and their use US Patent  US9489013 Publication Date 11/8/2016 
Target
Name:
Beta-secretase 1
Synonyms:
ASP2 Aspartyl protease 2 BACE1 Beta-secretase (BACE) Beta-secretase 1 (BACE 1) Beta-secretase 1 (BACE1) Beta-site amyloid precursor protein cleaving enzyme 1 Memapsin-2 beta-Secretase (BACE-1) | beta-Secretase (BACE1)
Type:
Protein
Mol. Mass.:
55755.10
Organism:
Homo sapiens (Human)
Description:
P56817
Residue:
501
  
Inhibitor
Name:
BDBM256786
Synonyms:
US9489013, 57
Type:
Small organic molecule
Emp. Form.:
C25H33FN6O6S2
Mol. Mass.:
596.695
SMILES:
COc1ccc(nc1)C(=O)Nc1ccc(F)c(c1)[C@@]1(C)NC(=N)N(C)S(=O)(=O)[C@@]11CCN(C1)S(=O)(=O)CC(C)C
: