Target
Interleukin-1 receptor-associated kinase 4
Ligand
BDBM294289
Substrate
Meas. Tech.
IMAP Technology
pH
7.2±n/a
IC50
2725±n/a nM
Comments
extracted
Citation
 Seganish, WMHanisak, JLi, GZhang, RTang, H Inhibitors of IRAK4 activity US Patent  US9586948 Publication Date 3/7/2017 
Target
Name:
Interleukin-1 receptor-associated kinase 4
Synonyms:
IRAK-4 IRAK4_HUMAN Interleukin-1 receptor-associated kinase 4 (IRAK4) | Renal carcinoma antigen NY-REN-64
Type:
Protein
Mol. Mass.:
51519.08
Organism:
Homo sapiens (Human)
Description:
Q9NWZ3
Residue:
460
  
Inhibitor
Name:
BDBM294289
Synonyms:
US9586948, Example 8
Type:
Small organic molecule
Emp. Form.:
C20H21N7O2
Mol. Mass.:
391.4264
SMILES:
Cn1ncc(NC(=O)c2cccc(n2)-c2ccnc(NCC3CC3)c2)c1C(N)=O
: