Target
Interleukin-1 receptor-associated kinase 4
Ligand
BDBM294320
Substrate
Meas. Tech.
IMAP Technology
pH
7.2±n/a
IC50
2914±n/a nM
Comments
extracted
Citation
 Seganish, WMHanisak, JLi, GZhang, RTang, H Inhibitors of IRAK4 activity US Patent  US9586948 Publication Date 3/7/2017 
Target
Name:
Interleukin-1 receptor-associated kinase 4
Synonyms:
IRAK-4 IRAK4_HUMAN Interleukin-1 receptor-associated kinase 4 (IRAK4) | Renal carcinoma antigen NY-REN-64
Type:
Protein
Mol. Mass.:
51519.08
Organism:
Homo sapiens (Human)
Description:
Q9NWZ3
Residue:
460
  
Inhibitor
Name:
BDBM294320
Synonyms:
US9586948, Example 39
Type:
Small organic molecule
Emp. Form.:
C25H30N8O2
Mol. Mass.:
474.5581
SMILES:
CN1CCN(CC1)C(=O)c1nn(C)cc1NC(=O)c1cccc(n1)-c1ccnc(NCC2CC2)c1
: