Target
Leucine-rich repeat serine/threonine-protein kinase 2 [970-2527,G2019S]
Ligand
BDBM257312
Substrate
Meas. Tech.
Km ATP LanthaScreen Assay
pH
8.5±n/a
Temperature
298.15±n/a K
IC50
<0.6±n/a nM
Comments
extracted
Citation
 Miller, MBasu, KDeMong, DScott, JLi, WStamford, APoirer, MTempest, P Compounds inhibiting leucine-rich repeat kinase enzyme activity US Patent  US9493440 Publication Date 11/15/2016 
Target
Name:
Leucine-rich repeat serine/threonine-protein kinase 2 [970-2527,G2019S]
Synonyms:
LRRK2 Leucine-rich repeat serine/threonine-protein kinase 2 (LRRK2) (G2019S) PARK8
Type:
Protein
Mol. Mass.:
177347.59
Organism:
Homo sapiens (Human)
Description:
Human LRRK2 variant (970-2527aa) with G2019S mutation
Residue:
1558
  
Inhibitor
Name:
BDBM257312
Synonyms:
US9493440, 156
Type:
Small organic molecule
Emp. Form.:
C20H21FN6O2
Mol. Mass.:
396.4181
SMILES:
CN1CCN(CC1=O)c1cc(ncn1)-c1n[nH]c2cc(F)c(OC3(C)CC3)cc12
: