Target
Sphingosine 1-phosphate receptor 1
Ligand
BDBM65155
Substrate
Meas. Tech.
Binding Assay
pH
7.5±n/a
Temperature
298.15±n/a K
IC50
55±n/a nM
Comments
extracted
Citation
 Dyckman, AJDhar, TGXiao, HGilmore, JLYang, MGXiao, ZMarcoux, D Substituted bicyclic compounds US Patent  US9522888 Publication Date 12/20/2016 
Target
Name:
Sphingosine 1-phosphate receptor 1
Synonyms:
CHEDG1 Endothelial differentiation G-protein coupled receptor 1 S1P1 S1PR1_HUMAN Sphingosine 1-phosphate receptor Edg-1
Type:
Enzyme
Mol. Mass.:
42836.02
Organism:
Homo sapiens (Human)
Description:
P21453
Residue:
382
  
Inhibitor
Name:
BDBM65155
Synonyms:
US9522888, 505
Type:
Emp. Form.:
C21H34NO4PS
Mol. Mass.:
427.538
SMILES:
CCCCSC[C@H]1CCc2cc(ccc2C1)[C@@H]1CC[C@](N)(COP(O)(O)=O)C1
: