Target
Sphingosine 1-phosphate receptor 1
Ligand
BDBM65231
Substrate
Meas. Tech.
hS1P1ERK Phosphorylation Assay
Temperature
310.15±n/a K
EC50
55±n/a nM
Comments
extracted
Citation
 Dyckman, AJDhar, TGXiao, HGilmore, JLYang, MGXiao, ZMarcoux, D Substituted bicyclic compounds US Patent  US9522888 Publication Date 12/20/2016 
Target
Name:
Sphingosine 1-phosphate receptor 1
Synonyms:
CHEDG1 Endothelial differentiation G-protein coupled receptor 1 S1P1 S1PR1_HUMAN Sphingosine 1-phosphate receptor Edg-1
Type:
Enzyme
Mol. Mass.:
42836.02
Organism:
Homo sapiens (Human)
Description:
P21453
Residue:
382
  
Inhibitor
Name:
BDBM65231
Synonyms:
US10166249, Example 562 | US9522888, 562
Type:
Emp. Form.:
C27H37N2O5P
Mol. Mass.:
500.5668
SMILES:
CN(C)C(=O)Cc1ccc(C[C@@H]2CCc3cc(ccc3C2)[C@H]2CC[C@](N)(COP(O)(O)=O)C2)cc1
: