Target
Sphingosine 1-phosphate receptor 1
Ligand
BDBM65244
Substrate
Meas. Tech.
hS1P1ERK Phosphorylation Assay
Temperature
310.15±n/a K
EC50
55±n/a nM
Comments
extracted
Citation
 Dyckman, AJDhar, TGXiao, HGilmore, JLYang, MGXiao, ZMarcoux, D Substituted bicyclic compounds US Patent  US9522888 Publication Date 12/20/2016 
Target
Name:
Sphingosine 1-phosphate receptor 1
Synonyms:
CHEDG1 Endothelial differentiation G-protein coupled receptor 1 S1P1 S1PR1_HUMAN Sphingosine 1-phosphate receptor Edg-1
Type:
Enzyme
Mol. Mass.:
42836.02
Organism:
Homo sapiens (Human)
Description:
P21453
Residue:
382
  
Inhibitor
Name:
BDBM65244
Synonyms:
US9522888, 574
Type:
Emp. Form.:
C21H27N2O4P
Mol. Mass.:
402.4238
SMILES:
N[C@]1(COP(O)(O)=O)CC[C@@H](C1)c1ccc2C[C@H](CCc2c1)c1ccncc1
: