Target
Beta-adrenergic receptor kinase 1
Ligand
BDBM258595
Substrate
Meas. Tech.
Competition Binding Assay
Temperature
298.15±n/a K
IC50
>20±n/a nM
Comments
extracted
Citation
 Akama, TJarnagin, KZhang, YZhou, YPlattner, JJSullivan, DC Boron-containing small molecules US Patent  US9493490 Publication Date 11/15/2016 
Target
Name:
Beta-adrenergic receptor kinase 1
Synonyms:
ADRBK1 BARK Beta-ARK-1 G-protein coupled receptor kinase 2 GRK2
Type:
Enzyme
Mol. Mass.:
79581.30
Organism:
Homo sapiens (Human)
Description:
P25098
Residue:
689
  
Inhibitor
Name:
BDBM258595
Synonyms:
US9493490, 6-(4-(aminomethyl)-2-fluorophenoxy)-7-methylbenzo[c][1,2]oxaborol-1(3H)-ol US9493490, Example 4
Type:
Small organic molecule
Emp. Form.:
C15H15BFNO3
Mol. Mass.:
287.094
SMILES:
Cc1c2B(O)OCc2ccc1Oc1ccc(CN)cc1F
: