Target
cAMP-dependent protein kinase catalytic subunit alpha
Ligand
BDBM258600
Substrate
Meas. Tech.
Competition Binding Assay
Temperature
298.15±n/a K
IC50
3.38±n/a nM
Comments
extracted
Citation
 Akama, TJarnagin, KZhang, YZhou, YPlattner, JJSullivan, DC Boron-containing small molecules US Patent  US9493490 Publication Date 11/15/2016 
Target
Name:
cAMP-dependent protein kinase catalytic subunit alpha
Synonyms:
KAPCA_HUMAN PKACA cAMP-dependent protein kinase (PKA) cAMP-dependent protein kinase catalytic subunit alpha cAMP-dependent protein kinase catalytic subunit alpha (PKACA) cAMP-dependent protein kinase catalytic subunit alpha isoform 1 | cAMP-dependent protein kinase, alpha-catalytic subunit
Type:
Enzyme Catalytic Subunit
Mol. Mass.:
40598.73
Organism:
Homo sapiens (Human)
Description:
Residue:
351
  
Inhibitor
Name:
BDBM258600
Synonyms:
US9493490, 6-(3-(aminomethyl)-2-fluorophenoxy)-7-methylbenzo[c][1,2]oxaborol-1(3H)-ol US9493490, M
Type:
Small organic molecule
Emp. Form.:
C15H15BFNO3
Mol. Mass.:
287.094
SMILES:
Cc1c2B(O)OCc2ccc1Oc1cccc(CN)c1F
: