Target
Melanin-concentrating hormone receptor 1 [E4Q,A5T]
Ligand
BDBM258758
Substrate
Meas. Tech.
Radioligand Binding Assay
pH
7.4±n/a
Ki
0.4±n/a nM
Comments
extracted
Citation
 Washburn, WNMurugaiah Subbaiah, MAAhmad, S Pyrrolone or pyrrolidinone melanin concentrating hormone receptor-1 antagonists US Patent  US9499482 Publication Date 11/22/2016 
Target
Name:
Melanin-concentrating hormone receptor 1 [E4Q,A5T]
Synonyms:
GPR24 MCHR1_HUMAN SLC1
Type:
Enzyme
Mol. Mass.:
46077.38
Organism:
Homo sapiens (Human)
Description:
Q99705 (E4Q, A5T)
Residue:
422
  
Inhibitor
Name:
BDBM258758
Synonyms:
US9499482, 157
Type:
Small organic molecule
Emp. Form.:
C28H34N2O5
Mol. Mass.:
478.58
SMILES:
COc1cc(ccc1OCCN1CC(O)(C1)C1CC1)N1CCC(Oc2ccc(cc2)C2CC2)C1=O
: