Target
Tyrosine-protein kinase BTK
Ligand
BDBM259441
Substrate
Meas. Tech.
Biochemical Enzyme Assay
pH
7.5±n/a
Temperature
303.15±n/a K
IC50
2±n/a nM
Comments
extracted
Citation
 Angst, DGessier, FVulpetti, A Amino pyrimidine derivatives US Patent  US9512084 Publication Date 12/6/2016 
Target
Name:
Tyrosine-protein kinase BTK
Synonyms:
AGMX1 Agammaglobulinaemia tyrosine kinase B cell progenitor kinase BPK BTK_HUMAN Tyrosine Kinase BTK Tyrosine-protein kinase BTK (BTK)
Type:
Enzyme
Mol. Mass.:
76289.95
Organism:
Homo sapiens (Human)
Description:
Q06187
Residue:
659
  
Inhibitor
Name:
BDBM259441
Synonyms:
US10457647, Example 40 US11673868, Example 40 | US9512084, 40
Type:
Small organic molecule
Emp. Form.:
C30H28F2N6O3
Mol. Mass.:
558.5785
SMILES:
Cc1c(NC(=O)c2ccc(cc2F)C2CC2)cc(F)cc1-c1ncnc(N)c1OC[C@@H]1C[C@@H](CN1C(=O)C=C)C#N
: