Target
Poly [ADP-ribose] polymerase tankyrase-1 [1091-1325]
Ligand
BDBM259579
Substrate
Meas. Tech.
Biochemical Assay
IC50
0.127±n/a nM
Citation
 Bregman, HBuchanan, JLChakka, NDimauro, EFGunaydin, HGuzman-Perez, AHua, ZHuang, X Quinazolinone compounds and derivatives thereof US Patent  US9505749 Publication Date 11/29/2016 
Target
Name:
Poly [ADP-ribose] polymerase tankyrase-1 [1091-1325]
Synonyms:
PARP5A TIN1 TNKS TNKS1_HUMAN | Tankyrase-1
Type:
Enzyme
Mol. Mass.:
26714.90
Organism:
Homo sapiens (Human)
Description:
O95271[1091-1325]
Residue:
235
  
Inhibitor
Name:
BDBM259579
Synonyms:
US9505749, 90
Type:
Small organic molecule
Emp. Form.:
C24H24ClN5O3S
Mol. Mass.:
497.997
SMILES:
Clc1ccc2n([C@H]3CC[C@@H](CC3)NC(=O)CCSc3nc4ccccc4c(=O)[nH]3)c(=O)[nH]c2c1
: