Target
Poly [ADP-ribose] polymerase tankyrase-2 [946-1162]
Ligand
BDBM259497
Substrate
Meas. Tech.
Biochemical Assay
IC50
0.475±n/a nM
Citation
 Bregman, HBuchanan, JLChakka, NDimauro, EFGunaydin, HGuzman-Perez, AHua, ZHuang, X Quinazolinone compounds and derivatives thereof US Patent  US9505749 Publication Date 11/29/2016 
Target
Name:
Poly [ADP-ribose] polymerase tankyrase-2 [946-1162]
Synonyms:
PARP5B TNKL TNKS2_HUMAN | Tankyrase-2
Type:
Enzyme
Mol. Mass.:
24581.05
Organism:
Homo sapiens (Human)
Description:
aa 946-1162
Residue:
217
  
Inhibitor
Name:
BDBM259497
Synonyms:
US9505749, 8
Type:
Small organic molecule
Emp. Form.:
C25H27N5O4
Mol. Mass.:
461.513
SMILES:
COc1ccc2n(C3CCN(CC3)C(=O)CCCc3nc4ccccc4c(=O)[nH]3)c(=O)[nH]c2c1
: