Target
Poly [ADP-ribose] polymerase tankyrase-2 [946-1162]
Ligand
BDBM259517
Substrate
Meas. Tech.
Biochemical Assay
IC50
0.303±n/a nM
Citation
 Bregman, HBuchanan, JLChakka, NDimauro, EFGunaydin, HGuzman-Perez, AHua, ZHuang, X Quinazolinone compounds and derivatives thereof US Patent  US9505749 Publication Date 11/29/2016 
Target
Name:
Poly [ADP-ribose] polymerase tankyrase-2 [946-1162]
Synonyms:
PARP5B TNKL TNKS2_HUMAN | Tankyrase-2
Type:
Enzyme
Mol. Mass.:
24581.05
Organism:
Homo sapiens (Human)
Description:
aa 946-1162
Residue:
217
  
Inhibitor
Name:
BDBM259517
Synonyms:
US9505749, 28
Type:
Small organic molecule
Emp. Form.:
C26H26FN5O3
Mol. Mass.:
475.5147
SMILES:
Fc1ccc(cc1)-c1nnc(o1)[C@H]1CC[C@@H](CC1)NC(=O)CCCc1nc2ccccc2c(=O)[nH]1
: