Target
Poly [ADP-ribose] polymerase tankyrase-2 [946-1162]
Ligand
BDBM259567
Substrate
Meas. Tech.
Biochemical Assay
IC50
0.434±n/a nM
Citation
 Bregman, HBuchanan, JLChakka, NDimauro, EFGunaydin, HGuzman-Perez, AHua, ZHuang, X Quinazolinone compounds and derivatives thereof US Patent  US9505749 Publication Date 11/29/2016 
Target
Name:
Poly [ADP-ribose] polymerase tankyrase-2 [946-1162]
Synonyms:
PARP5B TNKL TNKS2_HUMAN | Tankyrase-2
Type:
Enzyme
Mol. Mass.:
24581.05
Organism:
Homo sapiens (Human)
Description:
aa 946-1162
Residue:
217
  
Inhibitor
Name:
BDBM259567
Synonyms:
US9505749, 78
Type:
Small organic molecule
Emp. Form.:
C25H26N4O3
Mol. Mass.:
430.4989
SMILES:
O=C(CCCc1nc2ccccc2c(=O)[nH]1)N[C@H]1CC[C@@H](CC1)Oc1ccc(cc1)C#N
: