Target
Poly [ADP-ribose] polymerase tankyrase-2 [946-1162]
Ligand
BDBM259590
Substrate
Meas. Tech.
Biochemical Assay
IC50
0.458±n/a nM
Citation
 Bregman, HBuchanan, JLChakka, NDimauro, EFGunaydin, HGuzman-Perez, AHua, ZHuang, X Quinazolinone compounds and derivatives thereof US Patent  US9505749 Publication Date 11/29/2016 
Target
Name:
Poly [ADP-ribose] polymerase tankyrase-2 [946-1162]
Synonyms:
PARP5B TNKL TNKS2_HUMAN | Tankyrase-2
Type:
Enzyme
Mol. Mass.:
24581.05
Organism:
Homo sapiens (Human)
Description:
aa 946-1162
Residue:
217
  
Inhibitor
Name:
BDBM259590
Synonyms:
US9505749, 102
Type:
Small organic molecule
Emp. Form.:
C23H22ClN5O3S
Mol. Mass.:
483.97
SMILES:
Clc1ccc2[nH]c(=O)n([C@H]3CC[C@@H](CC3)NC(=O)CSc3nc4ccccc4c(=O)[nH]3)c2c1
: