Target
Poly [ADP-ribose] polymerase tankyrase-2 [946-1162]
Ligand
BDBM259609
Substrate
Meas. Tech.
Biochemical Assay
IC50
1.38±n/a nM
Citation
 Bregman, HBuchanan, JLChakka, NDimauro, EFGunaydin, HGuzman-Perez, AHua, ZHuang, X Quinazolinone compounds and derivatives thereof US Patent  US9505749 Publication Date 11/29/2016 
Target
Name:
Poly [ADP-ribose] polymerase tankyrase-2 [946-1162]
Synonyms:
PARP5B TNKL TNKS2_HUMAN | Tankyrase-2
Type:
Enzyme
Mol. Mass.:
24581.05
Organism:
Homo sapiens (Human)
Description:
aa 946-1162
Residue:
217
  
Inhibitor
Name:
BDBM259609
Synonyms:
US9505749, 122
Type:
Small organic molecule
Emp. Form.:
C25H23ClFN5O3S
Mol. Mass.:
527.998
SMILES:
Fc1ccc(cc1Cl)-c1nnc(o1)[C@H]1CC[C@@H](CC1)NC(=O)CCSc1nc2ccccc2c(=O)[nH]1
: