Target
Vasopressin V1b receptor
Ligand
BDBM260267
Substrate
Meas. Tech.
Binding Assay
pH
7.4±n/a
Temperature
277.15±n/a K
IC50
0.43±n/a nM
Comments
extracted
Citation
 Yoshinaga, MKuwada, TMiyakoshi, NIshizaka, TWakasugi, DShirokawa, SHattori, NShimazaki, Y Azole derivative US Patent  US9522914 Publication Date 12/20/2016 
Target
Name:
Vasopressin V1b receptor
Synonyms:
AVPR V1b AVPR1B Antidiuretic hormone receptor 1b V1bR VPR3 Vasopressin V1b receptor (V1b) Vasopressin V3 receptor
Type:
Enzyme
Mol. Mass.:
46985.01
Organism:
Homo sapiens (Human)
Description:
P47901
Residue:
424
  
Inhibitor
Name:
BDBM260267
Synonyms:
US9522914, B-20
Type:
Small organic molecule
Emp. Form.:
C29H37N5O3
Mol. Mass.:
503.6358
SMILES:
COc1cccc(c1)-c1nc(nn1CC(=O)NC(C)C)-c1ccc(CC(C)N2C3CCC2COC3)cc1
: