Target
Vasopressin V1b receptor
Ligand
BDBM260334
Substrate
Meas. Tech.
Binding Assay
pH
7.4±n/a
Temperature
277.15±n/a K
IC50
3.3±n/a nM
Comments
extracted
Citation
 Yoshinaga, MKuwada, TMiyakoshi, NIshizaka, TWakasugi, DShirokawa, SHattori, NShimazaki, Y Azole derivative US Patent  US9522914 Publication Date 12/20/2016 
Target
Name:
Vasopressin V1b receptor
Synonyms:
AVPR V1b AVPR1B Antidiuretic hormone receptor 1b V1bR VPR3 Vasopressin V1b receptor (V1b) Vasopressin V3 receptor
Type:
Enzyme
Mol. Mass.:
46985.01
Organism:
Homo sapiens (Human)
Description:
P47901
Residue:
424
  
Inhibitor
Name:
BDBM260334
Synonyms:
US9522914, D-23
Type:
Small organic molecule
Emp. Form.:
C28H34ClN5O4
Mol. Mass.:
540.054
SMILES:
COc1cc(ccc1CCN1C2CCC1COC2)-n1nc(CC(=O)NC(C)C)n(-c2cccc(Cl)c2)c1=O
: