Target
Integrin alpha-4/Integrin beta-7/Mucosal addressin cell adhesion molecule 1
Ligand
BDBM260659
Substrate
Meas. Tech.
Binding Inhibition Assay
pH
9.6±n/a
Temperature
277.15±n/a K
IC50
0.32±n/a nM
Comments
extracted
Citation
 Ueno, HYamamoto, TTakashita, RYokoyama, RSugiura, TKageyama, SAndo, AEda, HEviryanti, AMiyazawa, TKirihara, ATanabe, INakamura, TNoguchi, MShuto, MSugiki, MDohi, M Sulfonamide derivative and medicinal use thereof US Patent  US9533985 Publication Date 1/3/2017 
Target
Name:
Integrin alpha-4/Integrin beta-7/Mucosal addressin cell adhesion molecule 1
Synonyms:
Mucosal addressin cell adhesion molecule 1 (MAdCAM-1)/Alpha-4 Beta-7 Integrin
Type:
Enzyme
Mol. Mass.:
Description:
Components:
This complex has 3 components.
Component 1
Name:
Mucosal addressin cell adhesion molecule 1
Synonyms:
MADCA_MOUSE Mucosal addressin cell adhesion molecule 1 (MAdCAM-1)
Type:
Enzyme
Mol. Mass.:
43647.51
Organism:
Mus musculus (Mouse)
Description:
Q61826
Residue:
405
  
Component 2
Name:
Integrin alpha-4
Synonyms:
CD49 antigen-like family member D CD49d antigen ITA4_HUMAN Integrin alpha-4 Integrin alpha-IV VLA-4 integrin alpha 4 precursor | integrin alpha-4 precursor
Type:
Membrane Protein
Mol. Mass.:
114897.35
Organism:
Homo sapiens (Human)
Description:
P13612
Residue:
1032
  
Component 3
Name:
Integrin beta-7
Synonyms:
ITB7_HUMAN Integrin alpha-4/beta-7 Integrin beta7
Type:
Membrane Protein
Mol. Mass.:
86893.88
Organism:
Homo sapiens (Human)
Description:
P26010
Residue:
798
  
Inhibitor
Name:
BDBM260659
Synonyms:
US9533985, 47
Type:
Small organic molecule
Emp. Form.:
C35H30F2N8O7S
Mol. Mass.:
744.724
SMILES:
CN(C)c1ccc2n(C)c(=O)n(-c3ccc(C[C@H](NC(=O)c4c(F)cc(NS(=O)(=O)c5ccc(cc5)-n5cncn5)cc4F)C(O)=O)cc3)c(=O)c2c1
: