Target
Tyrosine-protein kinase SYK
Ligand
BDBM260697
Substrate
Meas. Tech.
ADP-Glo Kinase Assay
IC50
3.02±n/a nM
Citation
 Whitlock, GAGlossop, PA Substituted pyrimidine-5-carboxamides as spleen tyrosine kinase inhibitors US Patent  US9533989 Publication Date 1/3/2017 
Target
Name:
Tyrosine-protein kinase SYK
Synonyms:
KSYK_HUMAN Spleen Tyrosine Kinase Tyrosine-protein kinase SYK (Syk)
Type:
Enzyme
Mol. Mass.:
72079.99
Organism:
Homo sapiens (Human)
Description:
P43405
Residue:
635
  
Inhibitor
Name:
BDBM260697
Synonyms:
US9533989, 7
Type:
Small organic molecule
Emp. Form.:
C29H35N7O2
Mol. Mass.:
513.6339
SMILES:
COc1cccc(CCCn2ccc3c(Nc4nc(N[C@@H]5CCCC[C@@H]5N)ncc4C(N)=O)cccc23)c1
: