Target
Tyrosine-protein kinase SYK
Ligand
BDBM260695
Substrate
Meas. Tech.
ADP-Glo Kinase Assay
IC50
3.27±n/a nM
Citation
 Whitlock, GAGlossop, PA Substituted pyrimidine-5-carboxamides as spleen tyrosine kinase inhibitors US Patent  US9533989 Publication Date 1/3/2017 
Target
Name:
Tyrosine-protein kinase SYK
Synonyms:
KSYK_HUMAN Spleen Tyrosine Kinase Tyrosine-protein kinase SYK (Syk)
Type:
Enzyme
Mol. Mass.:
72079.99
Organism:
Homo sapiens (Human)
Description:
P43405
Residue:
635
  
Inhibitor
Name:
BDBM260695
Synonyms:
US9533989, 5 | US9533989, 8
Type:
Small organic molecule
Emp. Form.:
C23H26N6O2
Mol. Mass.:
418.4915
SMILES:
N[C@H]1CCCC[C@H]1Nc1ncc(C(N)=O)c(Nc2cccc(c2)-c2cccc(O)c2)n1
: