Target
D-amino-acid oxidase
Ligand
BDBM406238
Substrate
Meas. Tech.
In Vitro Measurements of porcine D-Amino Acid Oxidase (DAAO) Activities
IC50
55.0±n/a nM
Citation
 Tsai, GEWang, CHsieh, Y D-amino acid oxidase inhibitors and therapeutic uses thereof US Patent  US10336724 Publication Date 7/2/2019 
Target
Name:
D-amino-acid oxidase
Synonyms:
D-Amino Acid Oxidase (DAAO) DAMOX OXDA_PIG
Type:
Flavoprotein
Mol. Mass.:
39338.01
Organism:
Sus scrofa (pig)
Description:
Homodimer.
Residue:
347
  
Inhibitor
Name:
BDBM406238
Synonyms:
US10336724, Compound Table 1.18
Type:
Small organic molecule
Emp. Form.:
C28H24N4O3
Mol. Mass.:
464.5152
SMILES:
O=C(Oc1cc(CCc2cccc3ccccc23)n[nH]c1=O)c1cc(CCc2ccccc2)n[nH]1
: