Target
Tyrosine-protein kinase JAK1
Ligand
BDBM50159347
Substrate
Meas. Tech.
Enzymatic Assay
pH
7.5±n/a
Temperature
298.15±n/a K
IC50
3220±0.0 nM
Comments
extracted
Citation
 Xu, XWang, XMao, LZhao, LXi, B Pyrrolo[2,3-d]pyrimidine compounds as inhibitors of protein kinases US Patent  US9586965 Publication Date 3/7/2017 
Target
Name:
Tyrosine-protein kinase JAK1
Synonyms:
JAK-1 JAK1A JAK1_HUMAN Janus kinase 1 (JAK1) | Janus kinase 1 JAK1
Type:
Protein
Mol. Mass.:
133293.73
Organism:
Homo sapiens (Human)
Description:
P23458
Residue:
1154
  
Inhibitor
Name:
BDBM50159347
Synonyms:
CHEMBL3787662 | US9586965, Cpd 1
Type:
Small organic molecule
Emp. Form.:
C26H27N7O2
Mol. Mass.:
469.5383
SMILES:
CN1CCN(CC1)c1ccc(Nc2nc(Oc3cccc(NC(=O)C=C)c3)c3cc[nH]c3n2)cc1
: