Target
Bifunctional epoxide hydrolase 2
Ligand
BDBM409009
Substrate
Meas. Tech.
FRET-displacement assay
Ki
<0.050±n/a nM
Citation
 Hammock, BDLee, KSInceoglu, AB Potent soluble epdxide hydrolase inhibitors US Patent  US10377744 Publication Date 8/13/2019 
Target
Name:
Bifunctional epoxide hydrolase 2
Synonyms:
Cytosolic epoxide hydrolase 2 EPHX2 HYES_HUMAN Soluble epoxide hydrolase (sEH) | epoxide hydrolase 2, cytoplasmic
Type:
Enzyme
Mol. Mass.:
62613.07
Organism:
Homo sapiens (Human)
Description:
P34913
Residue:
555
  
Inhibitor
Name:
BDBM409009
Synonyms:
US10377744, Compound No. 30 US11723929, Compound 30
Type:
Small organic molecule
Emp. Form.:
C18H18F7N3O3
Mol. Mass.:
457.3426
SMILES:
Fc1cc(NC(=O)NC2CCN(CC2)C(=O)C2(CC2)C(F)(F)F)ccc1OC(F)(F)F
: