Target
Epoxide hydrolase
Ligand
BDBM25737
Substrate
Meas. Tech.
Inhibition Assay
IC50
21.0±n/a nM
Citation
 Guedes, AGHammock, BDMorisseau, C Treatment of inflammatory disorders in non-human mammals US Patent  US10383835 Publication Date 8/20/2019 
Target
Name:
Epoxide hydrolase
Synonyms:
EPHX1
Type:
Enzyme
Mol. Mass.:
48577.06
Organism:
Equus caballus (Horse)
Description:
A0A5F5PR84
Residue:
462
  
Inhibitor
Name:
BDBM25737
Synonyms:
12-[(adamantan-1-ylcarbamoyl)amino]dodecanoic acid US10383835, Compound 700 | Urea-based compound, 18
Type:
Small organic molecule
Emp. Form.:
C23H40N2O3
Mol. Mass.:
392.5753
SMILES:
OC(=O)CCCCCCCCCCCNC(=O)NC12CC3CC(CC(C3)C1)C2
: